1,4-Di-(p-fluorophenyl)butane-1,2,3,4-tetraone

Gas phase ion energetics data

Data compiled as indicated in comments:
LBLHLM - Sharon G. Lias, John E. Bartmess, Joel F. Liebman, John L. Holmes, Rhoda D. Levin, and W. Gary Mallard

Ionization energy determinations

IE (eV) Method Reference Comment
8.7PEGleiter and Dobler, 1985LBLHLM
9.1PEGleiter and Dobler, 1985Vertical value; LBLHLM

References

Gleiter and Dobler, 1985
Gleiter, R.; Dobler, W., Die elektronenstruktur von 1,4-disubstituierten butantetronen, Chem. Ber., 1985, 118, 1917. [all data]