SiCl3OONO2

Vibrational and/or electronic energy levels

Data compiled by: Marilyn E. Jacox

State:   X

Vib.
sym.
 No.   Approximate
 type of mode
 cm-1   Med.   Method   References

NO2 a-stretch 1748 gas IR Niki, Maker, et al., 1985
NO2 s-stretch 1297.2 gas IR Niki, Maker, et al., 1985
SiO stretch 924 gas IR Niki, Maker, et al., 1985
NO2 scissors 786 gas IR Niki, Maker, et al., 1985
SiCl stretch 634 gas IR Niki, Maker, et al., 1985

Additional references: Jacox, 1994, page 426

References

Niki, Maker, et al., 1985
Niki, H.; Maker, P.D.; Savage, C.M.; Breitenbach, L.P.; Hurley, M.D., FTIR study of the kinetics and mechanism for the chlorine-atom-initiated reactions of trichlorosilane, J. Phys. Chem., 1985, 89, 17, 3725, https://doi.org/10.1021/j100263a028 . [all data]

Jacox, 1994
Jacox, M.E., Vibrational and electronic energy levels of polyatomic transient molecules, American Chemical Society, Washington, DC, 1994, 464. [all data]