Indeno[5,6,7,1-pqra]perylene

Gas phase thermochemistry data

Data compiled by: Glushko Thermocenter, Russian Academy of Sciences, Moscow

Constant pressure heat capacity of gas

Cp,gas (cal/mol*K) Temperature (K) Reference Comment
11.4150.Dorofeeva O.V., 1989These statistically calculated values were obtained using force field approximation for polycyclic aromatic hydrocarbons to estimate the needed vibrational frequencies (see also [ Dorofeeva O.V., 1986, Moiseeva N.F., 1990]). These functions are reproduced in the reference book [ Frenkel M., 1994].
19.98100.
30.963150.
43.227200.
62.010273.15
68.4 ± 1.7298.15
68.836300.
92.483400.
112.18500.
127.91600.
140.41700.
150.44800.
158.60900.
165.321000.
170.901100.
175.581200.
179.531300.
182.891400.
185.771500.

References

Dorofeeva O.V., 1989
Dorofeeva O.V., Thermodynamic Properties of Gaseous Polycyclic Aromatic Hydrocarbons Containing Five-Membered Rings. Institute for High Temperatures, USSR Academy of Sciences, Preprint No.1-263 (in Russian), Moscow, 1989. [all data]

Dorofeeva O.V., 1986
Dorofeeva O.V., On calculation of thermodynamic properties of polycyclic aromatic hydrocarbons, Thermochim. Acta, 1986, 102, 59-66. [all data]

Moiseeva N.F., 1990
Moiseeva N.F., Group additivity scheme for calculating the chemical thermodynamic properties of gaseous polycyclic aromatic hydrocarbons containing five-membered rings, Thermochim. Acta, 1990, 168, 179-186. [all data]

Frenkel M., 1994
Frenkel M., Thermodynamics of Organic Compounds in the Gas State, Vol. I, II, Thermodynamics Research Center, College Station, Texas, 1994, 1994. [all data]