Iopanoic Acid

Phase change data

Data compiled by: William E. Acree, Jr., James S. Chickos

Enthalpy of fusion

ΔfusH (kJ/mol) Temperature (K) Method Reference
27.7427.DSCLi, Zell, et al., 1999

References

Li, Zell, et al., 1999
Li, Z. Jane; Zell, Mark T.; Munson, Eric J.; Grant, David J.W., Characterization of racemic species of chiral drugs using thermal analysis, thermodynamic calculation, and structural studies, J. Pharm. Sci., 1999, 88, 3, 337-346, https://doi.org/10.1021/js980205u . [all data]