HFe2OH

Vibrational and/or electronic energy levels

Data compiled by: Marilyn E. Jacox

State:   X

Vib.
sym.
 No.   Approximate
 type of mode
 cm-1   Med.   Method   References

FeH stretch 1713.1 Ar IR Kauffman, Hauge, et al., 1985
FeO stretch 649.9 Ar IR Kauffman, Hauge, et al., 1985
522.4 Ar IR Kauffman, Hauge, et al., 1985

Additional references: Jacox, 1994, page 247

References

Kauffman, Hauge, et al., 1985
Kauffman, J.W.; Hauge, R.H.; Margrave, J.L., Studies of reactions of atomic and diatomic chromium, manganese, iron, cobalt, nickel, copper, and zinc with molecular water at 15 K, J. Phys. Chem., 1985, 89, 16, 3541, https://doi.org/10.1021/j100262a023 . [all data]

Jacox, 1994
Jacox, M.E., Vibrational and electronic energy levels of polyatomic transient molecules, American Chemical Society, Washington, DC, 1994, 464. [all data]