HMnOMnH

Vibrational and/or electronic energy levels

Data compiled by: Marilyn E. Jacox

State:   X

Vib.
sym.
 No.   Approximate
 type of mode
 cm-1   Med.   Method   References

MnH stretch 1638.5 Ar IR Kauffman, Hauge, et al., 1985
Zhou, Zhang, et al., 2001
MnOMn stretch 870.5 Ar IR Kauffman, Hauge, et al., 1985
Zhou, Zhang, et al., 2001

Additional references: Jacox, 1994, page 247; Jacox, 2003, page 261

References

Kauffman, Hauge, et al., 1985
Kauffman, J.W.; Hauge, R.H.; Margrave, J.L., Studies of reactions of atomic and diatomic chromium, manganese, iron, cobalt, nickel, copper, and zinc with molecular water at 15 K, J. Phys. Chem., 1985, 89, 16, 3541, https://doi.org/10.1021/j100262a023 . [all data]

Zhou, Zhang, et al., 2001
Zhou, M.; Zhang, L.; Shao, L.; Wang, W.; Fan, K.; Qin, Q., Reactions of Mn with H, J. Phys. Chem. A, 2001, 105, 24, 5801, https://doi.org/10.1021/jp0043118 . [all data]

Jacox, 1994
Jacox, M.E., Vibrational and electronic energy levels of polyatomic transient molecules, American Chemical Society, Washington, DC, 1994, 464. [all data]

Jacox, 2003
Jacox, M.E., Vibrational and electronic energy levels of polyatomic transient molecules: supplement B, J. Phys. Chem. Ref. Data, 2003, 32, 1, 1-441, https://doi.org/10.1063/1.1497629 . [all data]