2-tert-Butyl-4-ethylphenol

Phase change data

Data compiled as indicated in comments:
AC - William E. Acree, Jr., James S. Chickos

Enthalpy of vaporization

ΔvapH (kJ/mol) Temperature (K) Method Reference Comment
59.2409.AStephenson and Malanowski, 1987Based on data from 394. - 523. K.; AC
57.0373.N/AStage, Müller, et al., 1953Based on data from 349. - 533. K.; AC
55.4398.N/AStage, Müller, et al., 1953Based on data from 349. - 533. K.; AC
54.2423.N/AStage, Müller, et al., 1953Based on data from 349. - 533. K.; AC
49.3473.N/AStage, Müller, et al., 1953Based on data from 349. - 533. K.; AC

Antoine Equation Parameters

log10(P) = A − (B / (T + C))
    P = vapor pressure (bar)
    T = temperature (K)

View plot Requires a JavaScript / HTML 5 canvas capable browser.

Temperature (K) A B C Reference Comment
349.5 - 521.05.689592896.056-11.302Stull, 1947Coefficents calculated by NIST from author's data.

References

Stephenson and Malanowski, 1987
Stephenson, Richard M.; Malanowski, Stanislaw, Handbook of the Thermodynamics of Organic Compounds, 1987, https://doi.org/10.1007/978-94-009-3173-2 . [all data]

Stage, Müller, et al., 1953
Stage, H.; Müller, E.; Faldix, P., Erdol u Kohle, 1953, 6, 375. [all data]

Stull, 1947
Stull, Daniel R., Vapor Pressure of Pure Substances. Organic and Inorganic Compounds, Ind. Eng. Chem., 1947, 39, 4, 517-540, https://doi.org/10.1021/ie50448a022 . [all data]