Neo-isopulegol

Van Den Dool and Kratz RI, non-polar column, temperature ramp

Data compiled by: NIST Mass Spectrometry Data Center, William E. Wallace, director

Column type CapillaryCapillaryCapillaryCapillary
Active phase BP-1DB-5DB-5DB-5
Column length (m) 50.30.30.30.
Carrier gas HeHeHeHe
Substrate
Column diameter (mm) 0.220.250.220.25
Phase thickness (μm) 0.250.250.250.25
Tstart (C) 60.60.55.90.
Tend (C) 220.246.240.220.
Heat rate (K/min) 2.3.3.4.
Initial hold (min)   2.2.
Final hold (min) 20. 15.
I 1142.1144.1144.1150.
ReferenceCastilho, Liu, et al., 2007Hongratanaworakit and Buchbauer, 2007Silva, Barbosa, et al., 2007Agnihotri, Agarwal, et al., 2005
Comment MSDC-RI MSDC-RI MSDC-RI MSDC-RI

References

Castilho, Liu, et al., 2007
Castilho, P.; Liu, K.; Rodrigues, A.I.; Feio, S.; Tomi, F.; Casanova, J., Composition and antimicrobial activity of the essential oil of Clinopodium ascendens (Jordan) Sampaio from Madeira, Flavour Fragr. J., 2007, 22, 2, 139-144, https://doi.org/10.1002/ffj.1771 . [all data]

Hongratanaworakit and Buchbauer, 2007
Hongratanaworakit, T.; Buchbauer, G., Chemical composition and stimulating effect of Citrus hystrix oil on humans, Flavour Fragr. J., 2007, 22, 5, 443-449, https://doi.org/10.1002/ffj.1820 . [all data]

Silva, Barbosa, et al., 2007
Silva, C.J.; Barbosa, L.C.A.; Maltha, C.R.A.; Pinheiro, A.L.; Ismail, F.M.D., Comparative study of the essential oils of seven Melaleuca (Myrtaceae) species grown in Brazil, Flavour Fragr. J., 2007, 22, 6, 474-478, https://doi.org/10.1002/ffj.1823 . [all data]

Agnihotri, Agarwal, et al., 2005
Agnihotri, V.K.; Agarwal, S.G.; Dhar, P.L.; Thappa, R.K.; Baleshwar; Kapahi, B.K.; Saxena, R.K.; Qazi, G.N., Essential oil composition of Mentha pulegium L. growing wild in the north-western Himalayas India, Flavour Fragr. J., 2005, 20, 6, 607-610, https://doi.org/10.1002/ffj.1497 . [all data]