FFI-

Vibrational and/or electronic energy levels

Data compiled by: Marilyn E. Jacox

State:   X

Vib.
sym.
 No.   Approximate
 type of mode
 cm-1   Med.   Method   References

Σ+ 1 FF stretch 354 Cs Ar IR Miller and Andrews, 1979
1 FF stretch 356 Rb Ar IR Miller and Andrews, 1979
1 FF stretch 357 K Ar IR Miller and Andrews, 1979

Additional references: Jacox, 1994, page 118

References

Miller and Andrews, 1979
Miller, J.H.; Andrews, L., Infrared spectra of the M+BrF2- and M+IF2- ion pairs in solid argon, Inorg. Chem., 1979, 18, 4, 988, https://doi.org/10.1021/ic50194a022 . [all data]

Jacox, 1994
Jacox, M.E., Vibrational and electronic energy levels of polyatomic transient molecules, American Chemical Society, Washington, DC, 1994, 464. [all data]