FSCN+

Vibrational and/or electronic energy levels

Data compiled by: Marilyn E. Jacox

State:   G

 Energy
 (cm-1
 Med.   Transition   λmin
 (nm)
 λmax
 (nm)

References

Tx = 68300 ± 1000 gas Jonkers, Grabandt, et al., 1982

State:   F

 Energy
 (cm-1
 Med.   Transition   λmin
 (nm)
 λmax
 (nm)

Tx = 53800 ± 1000 gas Jonkers, Grabandt, et al., 1982

State:   E

 Energy
 (cm-1
 Med.   Transition   λmin
 (nm)
 λmax
 (nm)

Tx = 52200 ± 1000 gas Jonkers, Grabandt, et al., 1982

State:   D

 Energy
 (cm-1
 Med.   Transition   λmin
 (nm)
 λmax
 (nm)

Tx = 34450 ± 320 gas Jonkers, Grabandt, et al., 1982

State:   C

 Energy
 (cm-1
 Med.   Transition   λmin
 (nm)
 λmax
 (nm)

Tx = 23960 ± 1000 gas Jonkers, Grabandt, et al., 1982

State:   B

 Energy
 (cm-1
 Med.   Transition   λmin
 (nm)
 λmax
 (nm)

Tx = 21460 ± 320 gas Jonkers, Grabandt, et al., 1982

State:   A

 Energy
 (cm-1
 Med.   Transition   λmin
 (nm)
 λmax
 (nm)

Tx = 19900 ± 1000 gas Jonkers, Grabandt, et al., 1982

State:   X

Vib.
sym.
 No.   Approximate
 type of mode
 cm-1   Med.   Method   References

a' SF stretch 840 ± 50 gas PE Jonkers, Grabandt, et al., 1982

Additional references: Jacox, 1994, page 193

Jonkers, Grabandt, et al., 1982
Jonkers, G.; Grabandt, O.; Mooyman, R.; De Lange, C.A., He(I) photoelectron spectroscopy of transient species: Fluorothiocyanate (FSCN), J. Electron Spectrosc. Relat. Phenom., 1982, 26, 147. [all data]

Jacox, 1994
Jacox, M.E., Vibrational and electronic energy levels of polyatomic transient molecules, American Chemical Society, Washington, DC, 1994, 464. [all data]