SBr2+

Vibrational and/or electronic energy levels

Data compiled by: Marilyn E. Jacox

State:   B

 Energy
 (cm-1
 Med.   Transition   λmin
 (nm)
 λmax
 (nm)

References

To = 16000 T gas de Leeuw, Mooyman, et al., 1979

State:   X

Vib.
sym.
 No.   Approximate
 type of mode
 cm-1   Med.   Method   References

a1 1 SBr stretch 400 ± 50 gas PE de Leeuw, Mooyman, et al., 1979

Additional references: Jacox, 1994, page 112

de Leeuw, Mooyman, et al., 1979
de Leeuw, D.M.; Mooyman, R.; de Lange, C.A., He(I) photoelectron spectroscopy of transient species: The SBr2 molecule, Chem. Phys. Lett., 1979, 61, 1, 191, https://doi.org/10.1016/0009-2614(79)85116-7 . [all data]

Jacox, 1994
Jacox, M.E., Vibrational and electronic energy levels of polyatomic transient molecules, American Chemical Society, Washington, DC, 1994, 464. [all data]