(-)-cis-Isopiperitenol

Van Den Dool and Kratz RI, non-polar column, custom temperature program

View large format table.

Column type Active phase I Reference Comment
CapillaryHP-5MS1228.Andriamaharavo, 201430. m/0.25 mm/0.25 μm, He; Program: 60C (1 min) => 5 C/min => 210C => 10 C/min => 280C (15 min)

Normal alkane RI, non-polar column, temperature ramp

View large format table.

Column type Active phase I Reference Comment
CapillaryBP-11195.Boti, Muselli, et al., 200650. m/0.22 mm/0.25 μm, He, 2. K/min, 220. C @ 20. min; Tstart: 60. C
CapillarySE-301210.Peacock and Kuneman, 1985N2, 45. C @ 1. min, 4. K/min; Column length: 100. m; Column diameter: 0.25 mm; Tend: 250. C

Normal alkane RI, polar column, temperature ramp

View large format table.

Column type Active phase I Reference Comment
CapillaryBP-201739.Boti, Muselli, et al., 200650. m/0.22 mm/0.25 μm, He, 2. K/min, 220. C @ 20. min; Tstart: 60. C
CapillaryDB-Wax1739.Umano, Hagi, et al., 200260. m/0.25 mm/0.25 μm, He, 40. C @ 2. min, 2. K/min; Tend: 200. C
CapillaryDB-Wax1745.Werkhoff, Güntert, et al., 199860. m/0.32 mm/0.25 μm, H2, 3. K/min; Tstart: 60. C; Tend: 220. C
CapillaryCarbowax 20M1744.Kollmannsberger, Nitz, et al., 199245. m/0.32 mm/1.0 μm, Hydrogen, 60. C @ 5. min, 2. K/min; Tend: 200. C

References

Andriamaharavo, 2014
Andriamaharavo, N.R., Retention Data. NIST Mass Spectrometry Data Center., NIST Mass Spectrometry Data Center, 2014. [all data]

Boti, Muselli, et al., 2006
Boti, J.B.; Muselli, A.; Tomi, F.; Koukoua, G.; N'Guessan, T.Y.; Costa, J.; Casanova, J., Combined analysis of Cymbopogon giganteus Chiov. leaf oil from Ivory Coast by GC/RI, GC/MS and 13C-NMR, C.R. Chim., 2006, 9, 1, 164-168, https://doi.org/10.1016/j.crci.2005.10.003 . [all data]

Peacock and Kuneman, 1985
Peacock, V.E.; Kuneman, D.W., Inhibition of the formation of α-p-dimethylstyrene and p-cymen-8-ol in a carbonated citral-containing beverage system, J. Agric. Food Chem., 1985, 33, 3, 330-335, https://doi.org/10.1021/jf00063a003 . [all data]

Umano, Hagi, et al., 2002
Umano, K.; Hagi, Y.; Shibamoto, T., Volatile chemicals identified in extracts from newly hybrid citrus, dekopon (Shiranuhi mandarin Suppl. J.), J. Agric. Food Chem., 2002, 50, 19, 5355-5359, https://doi.org/10.1021/jf0203951 . [all data]

Werkhoff, Güntert, et al., 1998
Werkhoff, P.; Güntert, M.; Krammer, G.; Sommer, H.; Kaulen, J., Vacuum headspace method in aroma research: flavor chemistry of yellow passion fruits, J. Agric. Food Chem., 1998, 46, 3, 1076-1093, https://doi.org/10.1021/jf970655s . [all data]

Kollmannsberger, Nitz, et al., 1992
Kollmannsberger, H.; Nitz, S.; Drawert, F., UBer die Aromastoffzusammensetzung von Hochdruckextrakten. I. Pfeffer (Piper nigrum, Var. muntok), Z. Lebensm. Unters Forsch., 1992, 194, 6, 545-551, https://doi.org/10.1007/BF01185481 . [all data]