9,10-Ethanoanthracene-11,12-dicarboxylic anhydride, 9,10-dihydro-9-phenyl- (7CI)

Reaction thermochemistry data

Data compiled by: Hussein Y. Afeefy, Joel F. Liebman, and Stephen E. Stein

Individual Reactions

Maleic anhydride + Anthracene, 9-phenyl- = C24H16O3

By formula: C4H2O3 + C20H14 = C24H16O3

Quantity Value Units Method Reference Comment
Δr-427.2kJ/molEqkLenz, Hegedus, et al., 1982liquid phase; solvent: 1,2,4-C6H3Cl3

References

Lenz, Hegedus, et al., 1982
Lenz, T.G.; Hegedus, L.S.; Vaughan, J.D., Liquid phase thermochemical energy conversion systems - an application of Diels-Alder chemistry, Int. J. Energy Res., 1982, 6, 357-365. [all data]