2-Imidazolidinethione

Gas phase ion energetics data

Data evaluated as indicated in comments:
HL - Edward P. Hunter and Sharon G. Lias
L - Sharon G. Lias

Data compiled as indicated in comments:
LLK - Sharon G. Lias, Rhoda D. Levin, and Sherif A. Kafafi

Quantity Value Units Method Reference Comment
IE (evaluated)8.15eVN/AN/AL
Quantity Value Units Method Reference Comment
Proton affinity (review)220.3kcal/molN/AHunter and Lias, 1998HL
Quantity Value Units Method Reference Comment
Gas basicity213.0kcal/molN/AHunter and Lias, 1998HL

Ionization energy determinations

IE (eV) Method Reference Comment
8.15PEAndreocci, Devillanova, et al., 1980LLK
8.15 ± 0.03PEGuimon, Pfister-Guillouzo, et al., 1974Vertical value; LLK

References

Hunter and Lias, 1998
Hunter, E.P.; Lias, S.G., Evaluated Gas Phase Basicities and Proton Affinities of Molecules: An Update, J. Phys. Chem. Ref. Data, 1998, 27, 3, 413-656, https://doi.org/10.1063/1.556018 . [all data]

Andreocci, Devillanova, et al., 1980
Andreocci, M.V.; Devillanova, F.A.; Furlani, C.; Mattogno, G.; Verani, G.; Zanoni, R., Structural characterization of some substituted azolidine molecules: UPS photoelectron spectroscopic studies, J. Mol. Struct., 1980, 69, 151. [all data]

Guimon, Pfister-Guillouzo, et al., 1974
Guimon, C.; Pfister-Guillouzo, G.; Arbelot, M.; Chanon, M., Electronic structure of sulphur compounds. VII. Photoelectron spectra of thiocarbonyl J. Heterocycl. Chem.., Tetrahedron, 1974, 30, 3831. [all data]

Bolshakov, et al., 1969
Bolshakov, G.F., et al., Ultraviolet Spectra of Heteroorganic Compounds, 1969, 361. [all data]