Benzoylcarboxyperoxide phenyl ester

Gas phase thermochemistry data

Data compiled by: Hussein Y. Afeefy, Joel F. Liebman, and Stephen E. Stein

Quantity Value Units Method Reference Comment
Δfgas-393. ± 10.kJ/molCcbKiparisova and Rabinovich, 1971

Condensed phase thermochemistry data

Data compiled by: Hussein Y. Afeefy, Joel F. Liebman, and Stephen E. Stein

Quantity Value Units Method Reference Comment
Δfsolid-484.9 ± 8.4kJ/molCcbKiparisova and Rabinovich, 1971
Quantity Value Units Method Reference Comment
Δcsolid-6453.4 ± 8.4kJ/molCcbKiparisova and Rabinovich, 1971Corresponding Δfsolid = -484.9 kJ/mol (simple calculation by NIST; no Washburn corrections)

References

Kiparisova and Rabinovich, 1971
Kiparisova, E.G.; Rabinovich, I.B., Thermochemistry of a series of acyl peroxides, Dokl. Phys. Chem. (Engl. Transl.), 1971, 199, 675-677, In original 1075. [all data]