1-Propene, 1,2,3-trichloro-

Condensed phase thermochemistry data

Data compiled by: Hussein Y. Afeefy, Joel F. Liebman, and Stephen E. Stein

Quantity Value Units Method Reference Comment
Δfliquid-102.0kJ/molCcrHu and Sinke, 1969
Quantity Value Units Method Reference Comment
Δcliquid-1578.4kJ/molCcrHu and Sinke, 1969

References

Hu and Sinke, 1969
Hu, A.T.; Sinke, G.C., Combustion calorimetry of some chlorinated organic compounds, J. Chem. Thermodyn., 1969, 1, 507-513. [all data]