2,3,3,4-tetramethyl-1,4-pentadiene

Phase change data

Data compiled by: Thermodynamics Research Center, NIST Boulder Laboratories, Chris Muzny director

Quantity Value Units Method Reference Comment
Tboil400.85KN/AFenske, Braun, et al., 1947Uncertainty assigned by TRC = 0.4 K

In addition to the Thermodynamics Research Center (TRC) data available from this site, much more physical and chemical property data is available from the following TRC products:

References

Fenske, Braun, et al., 1947
Fenske, M.R.; Braun, W.G.; Wiegand, R.V.; Quiggle, D.; McCormick, R.H.; Rank, D.H., Raman Spectra of Hydrocarbons, Anal. Chem., 1947, 19, 700. [all data]