HAlAlH

Vibrational and/or electronic energy levels

Data compiled by: Marilyn E. Jacox

State:   X

Vib.
sym.
 No.   Approximate
 type of mode
 cm-1   Med.   Method   References

1646.9 T Ar IR Chertihin and Andrews, 1993

Additional references: Jacox, 1998, page 220

References

Chertihin and Andrews, 1993
Chertihin, G.V.; Andrews, L., Reactions of pulsed-laser ablated aluminum atoms with hydrogen: infrared spectra of aluminum hydride (AlH, AlH2, AlH3, and Al2H2) species, J. Phys. Chem., 1993, 97, 40, 10295, https://doi.org/10.1021/j100142a007 . [all data]

Jacox, 1998
Jacox, M.E., Vibrational and electronic energy levels of polyatomic transient molecules: supplement A, J. Phys. Chem. Ref. Data, 1998, 27, 2, 115-393, https://doi.org/10.1063/1.556017 . [all data]