Phenol, 2,4,5-trichloro-

Van Den Dool and Kratz RI, polar column, temperature ramp

Data compiled by: NIST Mass Spectrometry Data Center, William E. Wallace, director

Column type CapillaryCapillaryCapillary
Active phase FFAPFFAPFFAP
Column length (m)
Carrier gas
Substrate
Column diameter (mm)
Phase thickness (μm)
Tstart (C) 100.100.100.
Tend (C)
Heat rate (K/min) 10.2.6.
Initial hold (min)
Final hold (min)
I 2458.2420.2444.
ReferenceKorhonen, 1984Korhonen, 1984Korhonen, 1984
Comment MSDC-RI MSDC-RI MSDC-RI

Lee's RI, non-polar column, temperature ramp

Data compiled by: NIST Mass Spectrometry Data Center, William E. Wallace, director

Column type Capillary
Active phase DB-5
Column length (m) 30.
Carrier gas He
Substrate
Column diameter (mm) 0.32
Phase thickness (μm) 0.25
Tstart (C) 40.
Tend (C) 285.
Heat rate (K/min) 8.
Initial hold (min) 3.
Final hold (min) 29.5
I 231.9
ReferenceDonnelly, Abdel-Hamid, et al., 1993
Comment MSDC-RI

Kovats' RI, non-polar column, custom temperature program

Data compiled by: NIST Mass Spectrometry Data Center, William E. Wallace, director

Column type Packed
Active phase SE-30
Column length (m) 2.9
Carrier gas
Substrate Chromosorb W HMDS (80-100 mesh)
Column diameter (mm)
Phase thickness (μm)
Program not specified
I 1362.
ReferenceGrzybowski, Lamparczyk, et al., 1980
Comment MSDC-RI

Normal alkane RI, non-polar column, temperature ramp

Data compiled by: NIST Mass Spectrometry Data Center, William E. Wallace, director

Column type Capillary
Active phase Ultra-1
Column length (m) 25.
Carrier gas He
Substrate
Column diameter (mm) 0.32
Phase thickness (μm) 0.25
Tstart (C) 80.
Tend (C) 260.
Heat rate (K/min) 3.
Initial hold (min)
Final hold (min)
I 1322.
ReferenceOkumura, 1991
Comment MSDC-RI

References

Korhonen, 1984
Korhonen, I.O.O., Gas-liquid chromatographic analyses. XXXI. Retention increments of isomeric chlorophenols on low-polarity (SE-30) and polar (FFAP) capillary columns, J. Chromatogr., 1984, 315, 185-200, https://doi.org/10.1016/S0021-9673(01)90736-8 . [all data]