Pentafluoropropionic acid, heptyl ester

Kovats' RI, polar column, isothermal

Data compiled by: NIST Mass Spectrometry Data Center, William E. Wallace, director

Column type PackedPacked
Active phase Carbowax 20MCarbowax 20M
Column length (m) 2.2.
Carrier gas
Substrate Chromosorb WChromosorb W
Column diameter (mm)
Phase thickness (μm)
Temperature (C) 100.140.
I 1025.1016.
ReferenceZarazir, Chovin, et al., 1970Zarazir, Chovin, et al., 1970
Comment MSDC-RI MSDC-RI

References

Zarazir, Chovin, et al., 1970
Zarazir, D.; Chovin, P.; Guiochon, G., Identification of hydroxylic compounds and their derivatives by gas chromatography, Chromatographia, 1970, 3, 4, 180-195, https://doi.org/10.1007/BF02269018 . [all data]