C2H6S2

Reaction thermochemistry data

Data compiled by: John E. Bartmess

Individual Reactions

C2H5S2- + Hydrogen cation = C2H6S2

By formula: C2H5S2- + H+ = C2H6S2

Quantity Value Units Method Reference Comment
Δr345.9 ± 2.4kcal/molG+TSKarty, Wu, et al., 2001gas phase
Quantity Value Units Method Reference Comment
Δr339.2 ± 2.1kcal/molIMREKarty, Wu, et al., 2001gas phase

References

Karty, Wu, et al., 2001
Karty, J.M.; Wu, Y.S.; Brauman, J.I., The RS-center dot HSR hydrogen bond: Acidities of alpha,omega- dithiols and electron affinities of their monoradicals, J. Am. Chem. Soc., 2001, 123, 40, 9800-9805, https://doi.org/10.1021/ja0039684 . [all data]