Cesium rubidium monochloride

Gas phase ion energetics data

Data compiled by: Sharon G. Lias, John E. Bartmess, Joel F. Liebman, John L. Holmes, Rhoda D. Levin, and W. Gary Mallard

Ionization energy determinations

IE (eV) Method Reference
3.5 ± 0.2PIKappes, Radi, et al., 1985

References

Kappes, Radi, et al., 1985
Kappes, M.M.; Radi, P.; Schar, M.; Schumacher, E., Photoionization measurements on dialkali monohalides generated in supersonic nozzle beams, Chem. Phys. Lett., 1985, 113, 243. [all data]