quinoline, 5-benzamido-8-bromo-6-ethyl-

Phase change data

Data compiled by: Thermodynamics Research Center, NIST Boulder Laboratories, Chris Muzny director

Quantity Value Units Method Reference Comment
Tfus493.65KN/AAltau, Beasley, et al., 1963Uncertainty assigned by TRC = 2. K

In addition to the Thermodynamics Research Center (TRC) data available from this site, much more physical and chemical property data is available from the following TRC products:

References

Altau, Beasley, et al., 1963
Altau, K.; Beasley, J.G.; Capps, J.D., 8-Bromo-6-Ethylquinoline and Some Derivatives, J. Chem. Eng. Data, 1963, 8, 130. [all data]