Adenosine, 2'-deoxy-

Gas phase ion energetics data

Data evaluated as indicated in comments:
HL - Edward P. Hunter and Sharon G. Lias

Data compiled as indicated in comments:
B - John E. Bartmess

Quantity Value Units Method Reference Comment
Proton affinity (review)991.5kJ/molN/AHunter and Lias, 1998HL
Quantity Value Units Method Reference Comment
Gas basicity959.1kJ/molN/AHunter and Lias, 1998HL

Electron affinity determinations

EA (eV) Method Reference Comment
0.70 ± 0.10LPESStokes, Li, et al., 2007Vertical Detachment Energy: 1.14 eV; B

De-protonation reactions

C10H12N5O3- + Hydrogen cation = Adenosine, 2'-deoxy-

By formula: C10H12N5O3- + H+ = C10H13N5O3

Quantity Value Units Method Reference Comment
Δr1426.0 ± 1.5kJ/molCIDCKumari, Devi, et al., 2010gas phase; The entropy of acidity values from the kinetic method given, seem unreasonably small for the structures shown - JEB; B

Reaction thermochemistry data

Data compiled by: John E. Bartmess

Individual Reactions

C10H12N5O3- + Hydrogen cation = Adenosine, 2'-deoxy-

By formula: C10H12N5O3- + H+ = C10H13N5O3

Quantity Value Units Method Reference Comment
Δr1426.0 ± 1.5kJ/molCIDCKumari, Devi, et al., 2010gas phase; The entropy of acidity values from the kinetic method given, seem unreasonably small for the structures shown - JEB

References

Hunter and Lias, 1998
Hunter, E.P.; Lias, S.G., Evaluated Gas Phase Basicities and Proton Affinities of Molecules: An Update, J. Phys. Chem. Ref. Data, 1998, 27, 3, 413-656, https://doi.org/10.1063/1.556018 . [all data]

Stokes, Li, et al., 2007
Stokes, S.T.; Li, X.; Grubisic, A.; Ko, Y.J.; Bowen, K.H., Intrinsic electrophilic properties of nucleosides: Photoelectron spectroscopy of their parent anions, J. Chem. Phys., 2007, 127, 8, 084321, https://doi.org/10.1063/1.2774985 . [all data]

Kumari, Devi, et al., 2010
Kumari, S.; Devi, C.L.; Prabhakar, S.; Bhanuprakash, K.; Vairaman, M., Estimation of Gas-Phase Acidities of Deoxyribonucleosides: An Experimental and Theoretical Study, J. Am. Soc. Mass Spectrom., 2010, 21, 1, 136-143, https://doi.org/10.1016/j.jasms.2009.09.019 . [all data]