Benzenamine, 2,5-dimethyl-

Phase change data

Data compiled as indicated in comments:
BS - Robert L. Brown and Stephen E. Stein
TRC - Thermodynamics Research Center, NIST Boulder Laboratories, Chris Muzny director
AC - William E. Acree, Jr., James S. Chickos

Quantity Value Units Method Reference Comment
Tboil491.2KN/AAldrich Chemical Company Inc., 1990BS
Tboil487.2KN/AWeast and Grasselli, 1989BS
Quantity Value Units Method Reference Comment
Tfus279.KN/AAhmed and Eades, 1972Crystal phase 1 phase; Uncertainty assigned by TRC = 1. K; TRC
Tfus287.4KN/ABirch, Dean, et al., 1949Uncertainty assigned by TRC = 1. K; TRC

Enthalpy of vaporization

ΔvapH (kJ/mol) Temperature (K) Reference Comment
61.7 ± 0.7317.Verevkin, 1997Based on data from 295. - 339. K.; AC

Enthalpy of fusion

ΔfusH (kJ/mol) Temperature (K) Reference Comment
13.7279.Ahmed and Eades, 1972AC

In addition to the Thermodynamics Research Center (TRC) data available from this site, much more physical and chemical property data is available from the following TRC products:

Gas phase ion energetics data

Data compiled as indicated in comments:
LLK - Sharon G. Lias, Rhoda D. Levin, and Sherif A. Kafafi
RDSH - Henry M. Rosenstock, Keith Draxl, Bruce W. Steiner, and John T. Herron

Ionization energy determinations

IE (eV) Method Reference Comment
7.2PESzepes, Distefano, et al., 1974LLK
7.5 ± 0.1CTSFarrell and Newton, 1966RDSH
7.78 ± 0.05PESzepes, Distefano, et al., 1974Vertical value; LLK

References

Aldrich Chemical Company Inc., 1990
Aldrich Chemical Company Inc., Catalog Handbook of Fine Chemicals, Aldrich Chemical Company, Inc., Milwaukee WI, 1990, 1. [all data]

Weast and Grasselli, 1989
CRC Handbook of Data on Organic Compounds, 2nd Editon, Weast,R.C and Grasselli, J.G., ed(s)., CRC Press, Inc., Boca Raton, FL, 1989, 1. [all data]

Ahmed and Eades, 1972
Ahmed, A.M.I.; Eades, R.G., Proton relaxation in solid aniline and some methyl derivatives, J. Chem. Soc., Faraday Trans. 2, 1972, 68, 2017, https://doi.org/10.1039/f29726802017 . [all data]

Birch, Dean, et al., 1949
Birch, S.F.; Dean, R.A.; Fidler, F.A.; Lowry, R.A., The preparation of the c(10) monocyclic aromatic hydrocarbons, J. Am. Chem. Soc., 1949, 71, 1362. [all data]

Verevkin, 1997
Verevkin, Sergey P., Thermochemistry of amines: experimental standard molar enthalpies of formation of some aliphatic and aromatic amines, The Journal of Chemical Thermodynamics, 1997, 29, 8, 891-899, https://doi.org/10.1006/jcht.1997.0212 . [all data]

Szepes, Distefano, et al., 1974
Szepes, L.; Distefano, G.; Pignataro, S., Steric inhibition of resonance in acetanilides by UV photoelectron spectroscopy, Ann. Chim., 1974, 64, 159. [all data]

Farrell and Newton, 1966
Farrell, P.G.; Newton, J., Ionization potentials of primary aromatic amines and aza-hydrocarbons, Tetrahedron Lett., 1966, 5517. [all data]