1,23-tetracosadiene

Phase change data

Data compiled by: Thermodynamics Research Center, NIST Boulder Laboratories, Chris Muzny director

Quantity Value Units Method Reference Comment
Tfus313.5KN/AMarvel and Garrison, 1959Uncertainty assigned by TRC = 2. K

In addition to the Thermodynamics Research Center (TRC) data available from this site, much more physical and chemical property data is available from the following TRC products:

References

Marvel and Garrison, 1959
Marvel, C.S.; Garrison, W.E., Polymerization of Higher a.pha.-Olefins eith Metal ALkyl Coordination Catalysts, J. Am. Chem. Soc., 1959, 81, 4737-44. [all data]