Aluminum, diethyl 1,4-di-tert-butyl-1,4-diazabutadiene

Gas phase ion energetics data

Data compiled by: Sharon G. Lias, John E. Bartmess, Joel F. Liebman, John L. Holmes, Rhoda D. Levin, and W. Gary Mallard

Ionization energy determinations

IE (eV) Method Reference Comment
5.8PELouwen, Stufkens, et al., 1984
6.14PELouwen, Stufkens, et al., 1984Vertical value

References

Louwen, Stufkens, et al., 1984
Louwen, J.N.; Stufkens, D.J.; Oskam, A., He(I) and He(II) photoelectron spectra of some organozinc and organoaluminium radicals containing 1,2-bis(t-butylimino)ethane, J. Chem. Soc. Dalton Trans., 1984, 2683. [all data]