Benzene, 2-chloro-1,4-dimethyl-

Phase change data

Data compiled by: Robert L. Brown and Stephen E. Stein

Quantity Value Units Method Reference Comment
Tboil460.2KN/AWeast and Grasselli, 1989

Kovats' RI, non-polar column, isothermal

View large format table.

Column type Active phase Temperature (C) I Reference Comment
CapillarySE-54115.1077.Bermejo, Blanco, et al., 1986N2; Column length: 25. m; Column diameter: 0.22 mm
CapillarySqualane115.1051.Bermejo, Blanco, et al., 1986N2; Column length: 45. m; Column diameter: 0.5 mm
PackedSqualane100.1046.Cook and Raushel, 1972He, Chromosorb W AW DMCS (80-100 mesh)

Van Den Dool and Kratz RI, non-polar column, temperature ramp

View large format table.

Column type Active phase I Reference Comment
CapillaryOV-11042.0Gautzsch and Zinn, 19968. K/min; Tstart: 35. C; Tend: 300. C

Normal alkane RI, non-polar column, isothermal

View large format table.

Column type Active phase Temperature (C) I Reference Comment
CapillaryE-301100.1054.Bermejo, Moinelo, et al., 1980N2; Column length: 50. m; Column diameter: 0.25 mm
CapillarySqualane100.1049.Bermejo, Moinelo, et al., 1980N2; Column length: 50. m; Column diameter: 0.25 mm

Normal alkane RI, non-polar column, temperature ramp

View large format table.

Column type Active phase I Reference Comment
CapillaryOV-1011044.Zenkevich, 2001N2, 4. K/min; Column length: 25. m; Column diameter: 0.20 mm; Tstart: 60. C; Tend: 240. C

References

Weast and Grasselli, 1989
CRC Handbook of Data on Organic Compounds, 2nd Editon, Weast,R.C and Grasselli, J.G., ed(s)., CRC Press, Inc., Boca Raton, FL, 1989, 1. [all data]

Bermejo, Blanco, et al., 1986
Bermejo, J.; Blanco, C.G.; Guillén, M.D., Gas chromatography of deuterated and protiated chloro derivatives of 1,4-dimethylbenzene, J. Chromatogr., 1986, 351, 425-432, https://doi.org/10.1016/S0021-9673(01)83520-2 . [all data]

Cook and Raushel, 1972
Cook, L.E.; Raushel, F.M., Calculation of retention indices for benzene and benzene derivatives on the basis of molecular structure, J. Chromatogr., 1972, 65, 3, 556-559, https://doi.org/10.1016/S0021-9673(00)85001-3 . [all data]

Gautzsch and Zinn, 1996
Gautzsch, R.; Zinn, P., Use of incremental models to estimate the retention indexes of aromatic compounds, Chromatographia, 1996, 43, 3/4, 163-176, https://doi.org/10.1007/BF02292946 . [all data]

Bermejo, Moinelo, et al., 1980
Bermejo, J.; Moinelo, S.R.; Suarez Canga, C., Calculo de indices de retencion a patir de DI y de la polaridad de la fase, Calculo de indices de retencion a patir de DI y de la polaridad de la fase, Instituto Nacional del Carbon y sus Derivados Francisco Pintado Fe (INCAR), La Corredoria, Oviedo, Espana, 1980, 13. [all data]

Zenkevich, 2001
Zenkevich, I.G., Interpretation of Gas Chromatographic Retention Indices in estimation of Structures of Isomeric Products of Radical Chlorinating of Alkyl Arenes, Zh. Org. Khim., 2001, 37, 2, 283-293. [all data]