Cyclo-tris(dimethoxyphosphonitrile)

Gas phase ion energetics data

Data compiled by: Henry M. Rosenstock, Keith Draxl, Bruce W. Steiner, and John T. Herron

Ionization energy determinations

IE (eV) Method Reference
9.29 ± 0.05EIBranton, Brion, et al., 1970

References

Branton, Brion, et al., 1970
Branton, G.R.; Brion, C.E.; Frost, D.C.; Mitchell, K.A.R.; Paddock, N.L., Phosphonitrilic derivatives. Part XVIII.lonisation potentials, orbital symmetry, and π-electron interactions, J. Chem. Soc., 1970, (A), 151. [all data]