Benzenamine, 3,4-dimethyl-

Normal alkane RI, non-polar column, temperature ramp

Data compiled by: NIST Mass Spectrometry Data Center, William E. Wallace, director

Column type CapillaryCapillaryCapillary
Active phase SE-30SE-30Ultra-1
Column length (m)   25.
Carrier gas   He
Substrate
Column diameter (mm)   0.32
Phase thickness (μm)   0.25
Tstart (C) 82.82.80.
Tend (C) 177.177.260.
Heat rate (K/min) 1.71.73.
Initial hold (min)
Final hold (min)
I 1173.81177.71161.
ReferenceBur'yan and Nabivach, 1992Bur'yan and Nabivach, 1992Okumura, 1991
Comment MSDC-RI MSDC-RI MSDC-RI

References

Bur'yan and Nabivach, 1992
Bur'yan, P.; Nabivach, V.M., Investigation of composition of higher heterocnitrogen bases of brown coal tar, Coke Chem. (Engl. Transl.), 1992, 5, 29-33. [all data]

Okumura, 1991
Okumura, T., retention indices of environmental chemicals on methyl silicone capillary column, Journal of Environmental Chemistry (Japan), 1991, 1, 2, 333-358, https://doi.org/10.5985/jec.1.333 . [all data]