1,2,4-Trimethylbenzene

Phase change data

Quantity Value Units Method Reference Comment
Tc649.1 ± 0.5KN/ATsonopoulos and Ambrose, 1995
Quantity Value Units Method Reference Comment
Pc32.3 ± 0.4barN/ATsonopoulos and Ambrose, 1995

References

Tsonopoulos and Ambrose, 1995
Tsonopoulos, C.; Ambrose, D., Vapor-Liquid Critical Properties of Elements and Compounds. 3. Aromatic Hydrocarbons, J. Chem. Eng. Data, 1995, 40, 547-558. [all data]