3-methyl-2-(methylthio)-6-(β-D-xylopyranosylamino)-4(3H)-pyrimidinone

Phase change data

Data compiled by: Thermodynamics Research Center, NIST Boulder Laboratories, Chris Muzny director

Quantity Value Units Method Reference Comment
Tfus502.KN/ALopez Garzon, Nogueras Montiel, et al., 1985Uncertainty assigned by TRC = 1. K

In addition to the Thermodynamics Research Center (TRC) data available from this site, much more physical and chemical property data is available from the following TRC products:

References

Lopez Garzon, Nogueras Montiel, et al., 1985
Lopez Garzon, R.; Nogueras Montiel, M.; Sanchez Rodrigo, A.; Negrillo Perez, J.; Bernalte Garcia, A.M., Spectroscopic and thermal characterization of some 4-glycopyranosylamino-pyrimidine derivatives, Thermochim. Acta, 1985, 91, 173. [all data]