1H-Cyclopropa[l]phenanthrene,1a,9b-dihydro-

Gas phase ion energetics data

Data compiled by: Sharon G. Lias, Rhoda D. Levin, and Sherif A. Kafafi

Ionization energy determinations

IE (eV) Method Reference Comment
7.77PEShudo, Kobayashi, et al., 1977Vertical value

References

Shudo, Kobayashi, et al., 1977
Shudo, K.; Kobayashi, T.; Utsunomiya, C., Photoelectron spectral studies on the interaction of three-membered rings with aryl groups, Tetrahedron, 1977, 33, 1721. [all data]