Butanoic acid, 4-(4-chloro-2-methylphenoxy)-

Kovats' RI, non-polar column, custom temperature program

View large format table.

Column type Active phase I Reference Comment
PackedSE-301820.Osselton and Snelling, 1986N2, Chromosorb W HP; Column length: 2. m; Program: not specified

References

Osselton and Snelling, 1986
Osselton, M.D.; Snelling, R.D., Chromatographic Identification of Pesticides, J. Chromatogr., 1986, 368, 265-271, https://doi.org/10.1016/S0021-9673(00)91068-9 . [all data]