3-ethyl-3-heptylundecamide

Phase change data

Data compiled by: Thermodynamics Research Center, NIST Boulder Laboratories, Chris Muzny director

Quantity Value Units Method Reference Comment
Tfus273.15KN/ARabjohn, Phillips, et al., 1962Uncertainty assigned by TRC = 2. K

In addition to the Thermodynamics Research Center (TRC) data available from this site, much more physical and chemical property data is available from the following TRC products:

References

Rabjohn, Phillips, et al., 1962
Rabjohn, N.; Phillips, L.V.; Stapp, P.R., Some β,β-Dialkyl-Substituted Aliphatic Acids and Their Derivatives, J. Chem. Eng. Data, 1962, 7, 543. [all data]