Ethyl cis-2-phenylcyclopropanecarboxylate

Phase change data

Data compiled by: William E. Acree, Jr., James S. Chickos

Quantity Value Units Method Reference Comment
Δvap16.9 ± 0.1kcal/molCKolesov, Pimenova, et al., 1998

References

Kolesov, Pimenova, et al., 1998
Kolesov, V.P.; Pimenova, S.M.; Lukyanova, V.A.; Kuznetsova, T.S.; Kozina, M.P., The thermochemistry of some polycyclic compounds, The Journal of Chemical Thermodynamics, 1998, 30, 12, 1455-1464, https://doi.org/10.1006/jcht.1998.0413 . [all data]