(Z)-Myroxide

Normal alkane RI, polar column, temperature ramp

Data compiled by: NIST Mass Spectrometry Data Center, William E. Wallace, director

Column type Capillary
Active phase Innowax
Column length (m) 50.
Carrier gas He
Substrate
Column diameter (mm) 0.2
Phase thickness (μm) 0.2
Tstart (C) 70.
Tend (C) 220.
Heat rate (K/min) 4.
Initial hold (min)
Final hold (min)
I 1493.
ReferencePalá-Paúl, García-Jiménez, et al., 2004
Comment MSDC-RI

Kovats' RI, polar column, temperature ramp

Data compiled by: NIST Mass Spectrometry Data Center, William E. Wallace, director

Column type Capillary
Active phase Innowax
Column length (m) 30.
Carrier gas He
Substrate
Column diameter (mm) 0.25
Phase thickness (μm) 0.25
Tstart (C) 50.
Tend (C) 250.
Heat rate (K/min) 0.5
Initial hold (min) 5.
Final hold (min) 10.
I 1550.
ReferenceViña and Murillo, 2003
Comment MSDC-RI

References

Palá-Paúl, García-Jiménez, et al., 2004
Palá-Paúl, J.; García-Jiménez, R.; Pérez-Alonso, M.J.; Velasco-Negueruela, A.; Sanz, J., Essential oil composition of the leaves and stems of Meum athamanticum Jacq., from Spain, J. Chromatogr. A, 2004, 1036, 2, 245-247, https://doi.org/10.1016/j.chroma.2004.02.064 . [all data]