(E)-Myroxide

Van Den Dool and Kratz RI, polar column, temperature ramp

Data compiled by: NIST Mass Spectrometry Data Center, William E. Wallace, director

Column type Capillary
Active phase Megawax
Column length (m) 30.
Carrier gas He
Substrate
Column diameter (mm) 0.25
Phase thickness (μm) 0.25
Tstart (C) 40.
Tend (C) 220.
Heat rate (K/min) 2.
Initial hold (min) 6.
Final hold (min) 10.
I 1465.
ReferenceVerzera, Trozzi, et al., 2000
Comment MSDC-RI

Normal alkane RI, non-polar column, temperature ramp

Data compiled by: NIST Mass Spectrometry Data Center, William E. Wallace, director

Column type CapillaryCapillaryCapillary
Active phase DB-5DB-1DB-5
Column length (m) 30.50.50.
Carrier gas HeliumHeHe
Substrate
Column diameter (mm) 0.320.220.2
Phase thickness (μm) 0.250.250.25
Tstart (C) 60.70.50.
Tend (C) 280.220.220.
Heat rate (K/min) 3.4.3.
Initial hold (min)   2.
Final hold (min)   10.
I 1140.1142.1139.
ReferenceGeorgiou, Koutsaviti, et al., 2010Palá-Paúl, García-Jiménez, et al., 2004Juteau, Jerkovic, et al., 2003
Comment MSDC-RI MSDC-RI MSDC-RI

References

Verzera, Trozzi, et al., 2000
Verzera, A.; Trozzi, A.; Cotroneo, A.; Lorenzo, D.; Dellacassa, E., Uruguayan essential oil. 12. Composition of Nova and Satsuma mandarin oils, J. Agric. Food Chem., 2000, 48, 7, 2903-2909, https://doi.org/10.1021/jf990734z . [all data]