(1R,3aR,4aR,8aR)-1,4,4,6-Tetramethyl-1,2,3,3a,4,4a,7,8-octahydrocyclopenta[1,4]cyclobuta[1,2]benzene

Normal alkane RI, polar column, custom temperature program

Data compiled by: NIST Mass Spectrometry Data Center, William E. Wallace, director

Column type Capillary
Active phase HP-Innowax
Column length (m) 50.
Carrier gas He
Substrate
Column diameter (mm) 0.2
Phase thickness (μm) 0.2
Program 40C(5min) => 2C/min => 250C (15min) => 10C/min => 270C
I 1497.
ReferenceSenatore, Apostolides Arnold, et al., 2006
Comment MSDC-RI

References

Senatore, Apostolides Arnold, et al., 2006
Senatore, F.; Apostolides Arnold, N.; Piozzi, F.; Formisano, C., Chemical composition of the essential oil of Salvia microstegia Boiss. et Balansa growing wild in Lebanon, J. Chromatogr. A, 2006, 1108, 2, 276-278, https://doi.org/10.1016/j.chroma.2006.01.066 . [all data]