HCC-CHSe

Vibrational and/or electronic energy levels

Data compiled by: Marilyn E. Jacox

State:   X

Vib.
sym.
 No.   Approximate
 type of mode
 cm-1   Med.   Method   References

CH stretch 3322 s Ar IR Sander and Chapman, 1985
CC stretch 2072 m Ar IR Sander and Chapman, 1985
C=Se stretch ? 1058 m Ar IR Sander and Chapman, 1985
CH deform. 615 m Ar IR Sander and Chapman, 1985

Additional references: Jacox, 1994, page 329

References

Sander and Chapman, 1985
Sander, W.W.; Chapman, O.L., Propadieneselone, J. Org. Chem., 1985, 50, 4, 543, https://doi.org/10.1021/jo00204a027 . [all data]

Jacox, 1994
Jacox, M.E., Vibrational and electronic energy levels of polyatomic transient molecules, American Chemical Society, Washington, DC, 1994, 464. [all data]