Benzocaine

Condensed phase thermochemistry data

Data compiled by: Hussein Y. Afeefy, Joel F. Liebman, and Stephen E. Stein

Quantity Value Units Method Reference Comment
Δcsolid-4694.9 ± 0.8kJ/molCcbSullivan and Hunt, 1949
Δcsolid-4697.8 ± 0.8kJ/molCcbSullivan, Kibler, et al., 1948

Phase change data

Data compiled as indicated in comments:
TRC - Thermodynamics Research Center, NIST Boulder Laboratories, Chris Muzny director
AC - William E. Acree, Jr., James S. Chickos

Quantity Value Units Method Reference Comment
Tfus360. ± 10.KAVGN/AAverage of 6 values; Individual data points

Enthalpy of fusion

ΔfusH (kJ/mol) Temperature (K) Method Reference Comment
24.6362.6DSCWassvik, Holmén, et al., 2008AC
23.56362.8N/AAcree, 1991AC

In addition to the Thermodynamics Research Center (TRC) data available from this site, much more physical and chemical property data is available from the following TRC products:

Normal alkane RI, non-polar column, custom temperature program

Data compiled by: NIST Mass Spectrometry Data Center, William E. Wallace, director

Column type CapillaryCapillaryPackedOther
Active phase OV-1, SE-30, Methyl silicone, SP-2100, OV-101, DB-1, etc.CP Sil 5 CBSE-30Methyl Silicone
Column length (m) 50.25.
Carrier gas HydrogenHelium
Substrate
Column diameter (mm) 0.320.32
Phase thickness (μm)  0.48
Program not specified60 0C (2.5 min) 30 0C/min -> 190 0C 7 0C/min -> 295 9C (7 min)not specifiednot specified
I 1513.1555.1535.1555.
ReferenceWaggott and Davies, 1984Bogusz, Wijsbeek, et al., 1983Bogusz, Wijsbeek, et al., 1983Ardrey and Moffat, 1981
Comment MSDC-RI MSDC-RI MSDC-RI MSDC-RI

Normal alkane RI, non-polar column, isothermal

Data compiled by: NIST Mass Spectrometry Data Center, William E. Wallace, director

Column type CapillaryCapillary
Active phase JXRJXR
Column length (m)
Carrier gas
Substrate
Column diameter (mm)
Phase thickness (μm)
Temperature (C) 180.200.
I 1563.1574.
Referencevon Buchi, Lorini, et al., 1972von Buchi, Lorini, et al., 1972
Comment MSDC-RI MSDC-RI

References

Sullivan and Hunt, 1949
Sullivan, M.V.; Hunt, H., Heats of combustion. IV. The heats of combustion of five aromatic amines, J. Phys. Chem., 1949, 53, 497-500. [all data]

Sullivan, Kibler, et al., 1948
Sullivan, M.V.; Kibler, G.M.; Hunt, H., Heats of combustion of nitrogen containing compounds, Rpt. Tech. Memo. PUR-3 for USN Project SQUID Contract N6ori-104, Task Order No. 1 Designation No. NR 22 042 by Purdue University, Lafayette, IN, 1948, 1-46. [all data]

Wassvik, Holmén, et al., 2008
Wassvik, Carola M.; Holmén, Anders G.; Draheim, Rieke; Artursson, Per; Bergström, Christel A.S., Molecular Characteristics for Solid-State Limited Solubility, J. Med. Chem., 2008, 51, 10, 3035-3039, https://doi.org/10.1021/jm701587d . [all data]

Acree, 1991
Acree, William E., Thermodynamic properties of organic compounds: enthalpy of fusion and melting point temperature compilation, Thermochimica Acta, 1991, 189, 1, 37-56, https://doi.org/10.1016/0040-6031(91)87098-H . [all data]