4-Methyl-nonanal

Van Den Dool and Kratz RI, non-polar column, temperature ramp

Data compiled by: NIST Mass Spectrometry Data Center, William E. Wallace, director

Column type Capillary
Active phase SPB-1
Column length (m) 30.
Carrier gas He
Substrate
Column diameter (mm) 0.25
Phase thickness (μm) 1.
Tstart (C) 60.
Tend (C) 250.
Heat rate (K/min) 5.
Initial hold (min) 5.
Final hold (min)
I 1155.
ReferenceNaef and Jaquier, 2006
Comment MSDC-RI

References

Naef and Jaquier, 2006
Naef, R.; Jaquier, A., New aldehydes and related alcohols in fresh lemon peel extract (Citrus limon L.), Flavour Fragr. J., 2006, 21, 5, 768-771, https://doi.org/10.1002/ffj.1678 . [all data]