Propanoic acid, 2-phenoxy-

Phase change data

Data compiled as indicated in comments:
BS - Robert L. Brown and Stephen E. Stein
AC - William E. Acree, Jr., James S. Chickos

Quantity Value Units Method Reference Comment
Tboil538.2KN/AAldrich Chemical Company Inc., 1990BS

Enthalpy of fusion

ΔfusH (kcal/mol) Temperature (K) Reference Comment
7.899388.Chickos, Braton, et al., 1991AC

References

Aldrich Chemical Company Inc., 1990
Aldrich Chemical Company Inc., Catalog Handbook of Fine Chemicals, Aldrich Chemical Company, Inc., Milwaukee WI, 1990, 1. [all data]

Chickos, Braton, et al., 1991
Chickos, James S.; Braton, C. Marie; Hesse, Donald G.; Liebman, Joel F., Estimating entropies and enthalpies of fusion of organic compounds, J. Org. Chem., 1991, 56, 3, 927-938, https://doi.org/10.1021/jo00003a007 . [all data]