1-Ethyl-4-methyl-d3-benzene

Gas phase ion energetics data

Data compiled by: Henry M. Rosenstock, Keith Draxl, Bruce W. Steiner, and John T. Herron

Appearance energy determinations

Ion AE (eV) Other Products MethodReferenceComment
C8H9+11.2 ± 0.1CD3EIMeyer and Harrison, 1964

References

Meyer and Harrison, 1964
Meyer, F.; Harrison, A.G., A mechanism for tropylium ion formation by electron impact, J. Am. Chem. Soc., 1964, 86, 4757. [all data]