cis-1-Phenylcyclopropane-2-carboxylic acid

Condensed phase thermochemistry data

Data compiled by: Hussein Y. Afeefy, Joel F. Liebman, and Stephen E. Stein

Quantity Value Units Method Reference Comment
Δfsolid-320. ± 2.4kJ/molCcbPimenova, Masyutina, et al., 1970
Quantity Value Units Method Reference Comment
Δcsolid-5043.6 ± 2.4kJ/molCcbPimenova, Masyutina, et al., 1970Corresponding Δfsolid = -320.7 kJ/mol (simple calculation by NIST; no Washburn corrections)

References

Pimenova, Masyutina, et al., 1970
Pimenova, S.M.; Masyutina, L.V.; Kozina, M.P.; Skuratov, S.M.; Ii-hsein, U.; Bolesov, I.G.; Levina, R.Ya., Heats of combustion in cis and trans isomers of 1-phenylcyclopropane-2-carboxylic acid, J. Gen. Chem. USSR, 1970, 40, 2099-2101. [all data]