2-methyl-1-(2-methylphenyl)naphthalene

Phase change data

Data compiled by: Thermodynamics Research Center, NIST Boulder Laboratories, Chris Muzny director

Quantity Value Units Method Reference Comment
Tboil408.KN/ABergmann and Pelchowica, 1954Uncertainty assigned by TRC = 6. K

In addition to the Thermodynamics Research Center (TRC) data available from this site, much more physical and chemical property data is available from the following TRC products:

References

Bergmann and Pelchowica, 1954
Bergmann, E.D.; Pelchowica, Z., J. Org. Chem., 1954, 19, 1383. [all data]