Phenylpropanol

Van Den Dool and Kratz RI, polar column, temperature ramp

View large format table.

Column type Active phase I Reference Comment
CapillaryHP-20M1980.Politeo, Jukic, et al., 200750. m/0.20 mm/0.20 μm, Helium, 70. C @ 4. min, 4. K/min, 180. C @ 15. min

References

Politeo, Jukic, et al., 2007
Politeo, O.; Jukic, M.; Milos, M., Chemical Composition and Antioxidant Activity of Free Volatile Aglycones from Laurel (Laurus nobilis L.) Compared to Its Essential Oil, Croatica Chem. Acta, 2007, 80, 1, 121-126. [all data]