Glyceryl tris(10-undecenoate)

Condensed phase thermochemistry data

Data compiled by: Hussein Y. Afeefy, Joel F. Liebman, and Stephen E. Stein

Quantity Value Units Method Reference Comment
Δcliquid-21401.2 ± 1.3kJ/molCcbFreedman, Bagby, et al., 1989Corresponding Δfliquid = -1625.9 kJ/mol (simple calculation by NIST; no Washburn corrections)

References

Freedman, Bagby, et al., 1989
Freedman, B.; Bagby, M.O.; Khoury, H., Correlation of heats of combustion with empirical formulas for fatty alcohols, J. Am. Oil Chem. Soc., 1989, 66, 595-596. [all data]