C14H11N

Gas phase ion energetics data

Data compiled by: John E. Bartmess

De-protonation reactions

C14H10N- + Hydrogen cation = C14H11N

By formula: C14H10N- + H+ = C14H11N

Quantity Value Units Method Reference Comment
Δr1470. ± 8.8kJ/molG+TSTaft, 1987gas phase; value altered from reference due to change in acidity scale
Quantity Value Units Method Reference Comment
Δr1448. ± 8.4kJ/molIMRETaft, 1987gas phase; value altered from reference due to change in acidity scale

Reaction thermochemistry data

Data compiled by: John E. Bartmess

Individual Reactions

C14H10N- + Hydrogen cation = C14H11N

By formula: C14H10N- + H+ = C14H11N

Quantity Value Units Method Reference Comment
Δr1470. ± 8.8kJ/molG+TSTaft, 1987gas phase; value altered from reference due to change in acidity scale
Quantity Value Units Method Reference Comment
Δr1448. ± 8.4kJ/molIMRETaft, 1987gas phase; value altered from reference due to change in acidity scale

References

Taft, 1987
Taft, R.W., The Nature and Analysis of Substitutent Electronic Effects, Personal communication. See also Prog. Phys. Org. Chem., 1987, 16, 1. [all data]