Benzo[c]thiophene, 1,3,3a,4,7,7a-hexahydro-2,2-dioxide

Gas phase ion energetics data

Data compiled as indicated in comments:
LBLHLM - Sharon G. Lias, John E. Bartmess, Joel F. Liebman, John L. Holmes, Rhoda D. Levin, and W. Gary Mallard

Ionization energy determinations

IE (eV) Method Reference Comment
9.2PEAitken, Gosney, et al., 1984LBLHLM
9.69PEAitken, Gosney, et al., 1984Vertical value; LBLHLM

References

Aitken, Gosney, et al., 1984
Aitken, R.A.; Gosney, I.; Farries, H.; Palmer, M.H.; Simpson, I.; Cadogan, J.I.G.; Tinley, E.J., Chemical repercussions of orbital interactions through bond and through space. The reactivity of the double bond in unsaturated cyclic sulphones towards aziridine formation and epoxidation, Tetrahedron, 1984, 40, 2487. [all data]